{"text_format":"1","workbook":"xlsx","n_sheets":3,"sheets":["入力フォーム","印刷シート","サンプル印刷シート"],"not_rendered":{"charts":0,"images":2,"macros":1,"external_links":0,"defined_names":2,"comments":0,"pivot_tables":0},"unopened":[],"bounds":{"document_bytes":16777216,"sheet_cells":100000,"rows_first":2000,"rows_last":500,"rows_between":2000,"halvings":0,"cell_chars":16384,"cell_head_chars":4096},"cells_cut":0,"cells_raw":0,"read":"whole","date_system":"1900"}

{"sheet":"入力フォーム","index":0,"n_rows":103,"n_cols":12,"rows_kept":103,"cut":false,"hidden":false,"merged":[[1,9,1,11],[8,2,9,2],[8,4,9,4],[8,3,9,3],[8,1,9,1],[1,1,2,1],[1,2,2,7],[3,1,4,1],[5,1,6,1],[5,2,6,7]]}
[]
[null,"専門部",null,null,null,null,null,null,null,"名簿"]
[null,null,null,null,null,null,null,null,null,"NO","氏名","学校名"]
[null,"日時",null,"月",null,"日",null,"曜日",null,1]
[null,null,null,"時",null,"分",null,null,null,2]
[null,"場所",null,null,null,null,null,null,null,3]
[null,null,null,null,null,null,null,null,null,4]
[null,null,null,null,null,null,null,null,null,5]
[2,"印刷NO",null,"～",null,null,null,null,null,6]
[null,null,null,null,null,null,null,null,null,7]
[null,null,null,null,null,null,null,null,null,8]
[null,null,null,null,null,null,null,null,null,9]
[null,null,null,null,null,null,null,null,null,10]
[null,null,null,null,null,null,null,null,null,11]
[null,null,null,null,null,null,null,null,null,12]
[null,null,null,null,null,null,null,null,null,13]
[null,null,null,null,null,null,null,null,null,14]
[null,null,null,null,null,null,null,null,null,15]
[null,null,null,null,null,null,null,null,null,16]
[null,null,null,null,null,null,null,null,null,17]
[null,null,null,null,null,null,null,null,null,18]
[null,null,null,null,null,null,null,null,null,19]
[null,null,null,null,null,null,null,null,null,20]
[null,null,null,null,null,null,null,null,null,21]
[null,null,null,null,null,null,null,null,null,22]
[null,null,null,null,null,null,null,null,null,23]
[null,null,null,null,null,null,null,null,null,24]
[null,null,null,null,null,null,null,null,null,25]
[null,null,null,null,null,null,null,null,null,26]
[null,null,null,null,null,null,null,null,null,27]
[null,null,null,null,null,null,null,null,null,28]
[null,null,null,null,null,null,null,null,null,29]
[null,null,null,null,null,null,null,null,null,30]
[null,null,null,null,null,null,null,null,null,31]
[null,null,null,null,null,null,null,null,null,32]
[null,null,null,null,null,null,null,null,null,33]
[null,null,null,null,null,null,null,null,null,34]
[null,null,null,null,null,null,null,null,null,35]
[null,null,null,null,null,null,null,null,null,36]
[null,null,null,null,null,null,null,null,null,37]
[null,null,null,null,null,null,null,null,null,38]
[null,null,null,null,null,null,null,null,null,39]
[null,null,null,null,null,null,null,null,null,40]
[null,null,null,null,null,null,null,null,null,41]
[null,null,null,null,null,null,null,null,null,42]
[null,null,null,null,null,null,null,null,null,43]
[null,null,null,null,null,null,null,null,null,44]
[null,null,null,null,null,null,null,null,null,45]
[null,null,null,null,null,null,null,null,null,46]
[null,null,null,null,null,null,null,null,null,47]
[null,null,null,null,null,null,null,null,null,48]
[null,null,null,null,null,null,null,null,null,49]
[null,null,null,null,null,null,null,null,null,50]
[null,null,null,null,null,null,null,null,null,51]
[null,null,null,null,null,null,null,null,null,52]
[null,null,null,null,null,null,null,null,null,53]
[null,null,null,null,null,null,null,null,null,54]
[null,null,null,null,null,null,null,null,null,55]
[null,null,null,null,null,null,null,null,null,56]
[null,null,null,null,null,null,null,null,null,57]
[null,null,null,null,null,null,null,null,null,58]
[null,null,null,null,null,null,null,null,null,59]
[null,null,null,null,null,null,null,null,null,60]
[null,null,null,null,null,null,null,null,null,61]
[null,null,null,null,null,null,null,null,null,62]
[null,null,null,null,null,null,null,null,null,63]
[null,null,null,null,null,null,null,null,null,64]
[null,null,null,null,null,null,null,null,null,65]
[null,null,null,null,null,null,null,null,null,66]
[null,null,null,null,null,null,null,null,null,67]
[null,null,null,null,null,null,null,null,null,68]
[null,null,null,null,null,null,null,null,null,69]
[null,null,null,null,null,null,null,null,null,70]
[null,null,null,null,null,null,null,null,null,71]
[null,null,null,null,null,null,null,null,null,72]
[null,null,null,null,null,null,null,null,null,73]
[null,null,null,null,null,null,null,null,null,74]
[null,null,null,null,null,null,null,null,null,75]
[null,null,null,null,null,null,null,null,null,76]
[null,null,null,null,null,null,null,null,null,77]
[null,null,null,null,null,null,null,null,null,78]
[null,null,null,null,null,null,null,null,null,79]
[null,null,null,null,null,null,null,null,null,80]
[null,null,null,null,null,null,null,null,null,81]
[null,null,null,null,null,null,null,null,null,82]
[null,null,null,null,null,null,null,null,null,83]
[null,null,null,null,null,null,null,null,null,84]
[null,null,null,null,null,null,null,null,null,85]
[null,null,null,null,null,null,null,null,null,86]
[null,null,null,null,null,null,null,null,null,87]
[null,null,null,null,null,null,null,null,null,88]
[null,null,null,null,null,null,null,null,null,89]
[null,null,null,null,null,null,null,null,null,90]
[null,null,null,null,null,null,null,null,null,91]
[null,null,null,null,null,null,null,null,null,92]
[null,null,null,null,null,null,null,null,null,93]
[null,null,null,null,null,null,null,null,null,94]
[null,null,null,null,null,null,null,null,null,95]
[null,null,null,null,null,null,null,null,null,96]
[null,null,null,null,null,null,null,null,null,97]
[null,null,null,null,null,null,null,null,null,98]
[null,null,null,null,null,null,null,null,null,99]
[null,null,null,null,null,null,null,null,null,100]

{"sheet":"印刷シート","index":1,"n_rows":25,"n_cols":14,"rows_kept":25,"cut":false,"hidden":false,"merged":[[0,10,0,13],[1,10,1,13],[2,10,2,13],[6,9,6,13],[17,8,17,11],[17,12,17,13],[24,1,24,3],[24,4,24,14],[4,1,4,7],[18,2,18,7],[20,7,20,8],[22,1,22,3],[22,4,22,11],[22,12,22,14],[23,1,23,3],[10,2,10,12],[11,2,11,12],[14,2,14,13],[15,2,15,4],[16,2,16,13],[17,2,17,6],[7,9,7,13]]}
[null,null,null,null,null,null,null,null,null,null,"(公印省略)"]
[null,null,null,null,null,null,null,null,null,null,"群高体連発第５号"]
[null,4,null,null,null,null,null,null,null,null,"2026-04-10"]
[null,{"$f":"VLOOKUP(B3,入力フォーム!$J$4:$L$103,3)","v":0}]
[null,{"$f":"IFERROR(INDEX(サンプル印刷シート!$E$40:$E$118,MATCH(印刷シート!B4,サンプル印刷シート!$D$40:$D$118,0),1),\"\")","v":""}]
[]
[null,null,null,null,null,null,null,null,null,"群馬県高等学校体育連盟"]
[null,null,null,null,null,null,null,null,null,"会　長　堀越　　晋"]
[]
[]
[null,null,"令和８年度第６１回県高校総体プロ編成会議の"]
[null,null,"職員派遣について（依頼）"]
[]
[]
[null,null,"　平素から本連盟につきましては、ご理解・ご支援を賜り深く感謝"]
[null,null,"申し上げます。"]
[null,null,"　さて、標記会議を下記により開催いたしますので、ご多用のおり"]
[null,null,"まことに恐縮に存じますが、",null,null,null,null,"貴校",{"$f":"IFERROR(VLOOKUP(B3,入力フォーム!$J$4:$K$103,2),\"\")","v":0},null,null,null,"様をご派遣"]
[null,null,"くださるようお願いいたします。"]
[]
[null,null,null,null,null,null,null,"記"]
[]
[null,"種　　目",null,null,{"$f":"入力フォーム!C2","v":0},null,null,null,null,null,null,null,"専門部"]
[null,"日　　時",null,null,null,{"$f":"入力フォーム!C4","v":0},"月",{"$f":"入力フォーム!E4","v":0},"日",{"$f":"\"(\"&入力フォーム!G4&\")\"","v":"()"},{"$f":"入力フォーム!C5","v":0},"時",{"$f":"入力フォーム!E5","v":0},"分"]
[null,"場　　所",null,null,{"$f":"入力フォーム!C6","v":0}]

{"sheet":"サンプル印刷シート","index":2,"n_rows":154,"n_cols":13,"rows_kept":154,"cut":false,"hidden":false,"merged":[[0,9,0,12],[22,1,22,3],[23,1,23,3],[24,1,24,3],[17,8,17,11],[22,4,22,11],[24,4,24,14],[22,12,22,14],[23,4,23,14],[4,1,4,5],[1,9,1,12],[2,9,2,12],[20,7,20,8],[15,2,15,4],[16,2,16,13],[17,2,17,6],[6,8,6,12],[7,8,7,12],[17,12,17,13],[18,2,18,7],[14,2,14,13],[10,2,10,12],[11,2,11,12]]}
[null,null,null,null,null,null,null,null,null,"(公印省略)"]
[null,null,null,null,null,null,null,null,null,"群高体連発第５号"]
[null,null,null,null,null,null,null,null,null,"2026-04-10"]
[]
[null,"◯◯◯◯学校長様"]
[]
[null,null,null,null,null,null,null,null,"群馬県高等学校体育連盟"]
[null,null,null,null,null,null,null,null,"会　長　堀越　　晋"]
[]
[]
[null,null,"令和８年度第６１回県高校総体プロ編成会議の"]
[null,null,"職員派遣について（依頼）"]
[]
[]
[null,null,"　平素から本連盟につきましては、ご理解・ご支援を賜り深く感謝"]
[null,null,"申し上げます。"]
[null,null,"　さて、標記会議を下記により開催いたしますので、ご多用のおり"]
[null,null,"まことに恐縮に存じますが、",null,null,null,null,"貴校","○○　○○",null,null,null,"様をご派遣"]
[null,null,"くださるようお願いいたします。"]
[]
[null,null,null,null,null,null,null,"記"]
[]
[null,"種　　目",null,null,"○○○○○○",null,null,null,null,null,null,null,"専門部"]
[null,"日　　時",null,null,"○月　○○日（　○　）　○○時　○○分"]
[null,"場　　所",null,null,"◯◯◯◯◯◯会議室"]
[]
[]
[]
[]
[]
[]
[]
[]
[]
[]
[]
[]
[]
[]
["　",1,"前　橋","1　前　橋","前橋高等学校長　様"]
["　",2,"清　陵","2　清　陵","前橋清陵高等学校長　様"]
["　",3,"前　工","3　前　工","前橋工業高等学校長　様"]
["　",4,"前　商","4　前　商","前橋商業高等学校長　様"]
["　",5,"勢　農","5　勢　農","勢多農林高等学校長　様"]
["　",6,"前　女","6　前　女","前橋女子高等学校長　様"]
["　",7,"市前橋","7　市前橋","市立前橋高等学校長　様"]
["　",8,"前　南","8　前　南","前橋南高等学校長　様"]
["　",9,"共　愛","9　共　愛","共愛学園高等学校長　様"]
["　",10,"育　英","10　育　英","前橋育英高等学校長　様"]
["　",11,"前　東","11　前　東","前橋東高等学校長　様"]
["　",12,"前　西","12　前　西","前橋西高等学校長　様"]
["　",13,"ろ　う","13　ろ　う","聾学校高等学校長　様"]
["　",14,"伊　商","14　伊　商","伊勢崎商業高等学校長　様"]
["　",15,"伊　工","15　伊　工","伊勢崎工業高等学校長　様"]
["　",16,"清　明","16　清　明","伊勢崎清明高等学校長　様"]
["　",17,"興　陽","17　興　陽","伊勢崎興陽高等学校長　様"]
["　",18,"玉　村","18　玉　村","玉村高等学校長　様"]
["　",19,"伊勢崎","19　伊勢崎","伊勢崎高等学校長　様"]
["　",20,"四ツ葉","20　四ツ葉","市立四ツ葉学園中等教育学校長　様"]
["　",21,"桐　生","21　桐　生","桐生高等学校長　様"]
["　",22,"桐　工","22　桐　工","桐生工業高等学校長　様"]
["　",23,"桐　商","23　桐　商","桐生市立商業高等学校長　様"]
["　",24,"桐　一","24　桐　一","桐生第一高等学校長　様"]
["　",25,"樹　徳","25　樹　徳","樹徳高等学校長　様"]
["　",26,"大間々","26　大間々","大間々高等学校長　様"]
["　",27,"清桜","27　清桜","桐生清桜高等学校長　様"]
["　",28,"太　田","28　太　田","太田高等学校長　様"]
["　",29,"太　女","29　太　女","太田女子高等学校長　様"]
["　",30,"太　工","30　太　工","太田工業高等学校長　様"]
["　",31,"新田暁","31　新田暁","新田暁高等学校長　様"]
["　",32,"市太田","32　市太田","市立太田高等学校長　様"]
["　",33,"常　磐","33　常　磐","常磐高等学校長　様"]
["　",34,"太　東","34　太　東","太田東高等学校長　様"]
["　",35,"太フ高","35　太フ高","太田フレックス高等学校長　様"]
["　",36,"ＧＫＡ","36　ＧＫＡ","ぐんま国際アカデミー高等部長　様"]
["　",37,"館　林","37　館　林","館林高等学校長　様"]
["　",38,"館　女","38　館　女","館林女子高等学校長　様"]
["　",39,"板　倉","39　板　倉","板倉高等学校長　様"]
["　",40,"関　学","40　関　学","関東学園大学附属高等学校長　様"]
["　",41,"大　泉","41　大　泉","大泉高等学校長　様"]
["　",42,"西邑楽","42　西邑楽","西邑楽高等学校長　様"]
["　",43,"館商工","43　館商工","館林商工高等学校長　様"]
["　",44,"渋　川","44　渋　川","渋川高等学校長　様"]
["　",45,"渋　女","45　渋　女","渋川女子高等学校長　様"]
["　",46,"渋　工","46　渋　工","渋川工業高等学校長　様"]
["　",47,"青　翠","47　青　翠","渋川青翠高等学校長　様"]
["　",48,"沼　田","48　沼　田","沼田高等学校長　様"]
["　",49,"尾　瀬","49　尾　瀬","尾瀬高等学校長　様"]
["　",50,"利根実","51　利根実","利根実業高等学校長　様"]
["　",51,"利　商","52　利　商","利根商業高等学校長　様"]
["　",52,"嬬　恋","53　嬬　恋","嬬恋高等学校長　様"]
["　",53,"長野原","54　長野原","長野原高等学校長　様"]
["　",54,"白　根","55　白　根","白根開善高等学校長　様"]
["　",55,"吾中央","56　吾中央","吾妻中央高等学校長　様"]
["　",56,"高　崎","57　高　崎","高崎高等学校長　様"]
["　",57,"高　工","58　高　工","高崎工業高等学校長　様"]
["　",58,"高　商","59　高　商","高崎商業高等学校長　様"]
["　",59,"高　女","60　高　女","高崎女子高等学校長　様"]
["　",60,"高経附","61　高経附","市立高崎経済大学附属高等学校長　様"]
["　",61,"農　二","62　農　二","東京農業大学第二高等学校長　様"]
["　",62,"商大附","63　商大附","高崎商科大学附属高等学校長　様"]
["　",63,"健大高崎","64　健大高崎","高崎健康福祉大学高崎高等学校長　様"]
["　",64,"高　北","65　高　北","高崎北高等学校長　様"]
["　",65,"榛　名","66　榛　名","榛名高等学校長　様"]
["　",66,"高　東","67　高　東","高崎東高等学校長　様"]
["　",67,"県　央","68　県　央","明和県央高等学校長　様"]
["　",68,"中央中等","69　中央中等","中央中等教育学校長　様"]
["　",69,"吉　井","70　吉　井","吉井高等学校長　様"]
["　",70,"松井田","71　松井田","松井田高等学校長　様"]
["　",71,"新　島","72　新　島","新島学園高等学校長　様"]
["　",72,"安総合","73　安総合","安中総合学園高等学校長　様"]
["　",73,"富　岡","74　富　岡","富岡高等学校長　様"]
["　",74,"富　実","75　富　実","富岡実業高等学校長　様"]
["　",75,"下仁田","76　下仁田","下仁田高等学校長　様"]
["　",76,"藤　工","77　藤　工","藤岡工業高等学校長　様"]
["　",77,"万　場","78　万　場","万場高等学校長　様"]
["　",78,"藤　北","79　藤　北","藤岡北高等学校長　様"]
["　",79,"藤中央","80　藤中央","藤岡中央高等学校長　様"]
["　"]
[]
[null,"月",6,"00",null,4,1,null,"陸上競技"]
[null,"火",7,15,null,5,2,null,"バスケットボール"]
[null,"水",8,30,null,6,3,null,"バレーボール"]
[null,"木",9,45,null,7,4,null,"ソフトテニス"]
[null,"金",10,null,null,8,5,null,"卓球"]
[null,"土",11,null,null,9,6,null,"ラ グ ビ ー"]
[null,"日",12,null,null,10,7,null,"サ ッ カ ー"]
[null,null,13,null,null,11,8,null,"ハンドボール"]
[null,null,14,null,null,12,9,null,"ソフトボール"]
[null,null,15,null,null,1,10,null,"水泳"]
[null,null,16,null,null,2,11,null,"体操"]
[null,null,17,null,null,3,12,null,"相撲"]
[null,null,null,null,null,null,13,null,"登山"]
[null,null,null,null,null,null,14,null,"バドミントン"]
[null,null,null,null,null,null,15,null,"スキー"]
[null,null,null,null,null,null,16,null,"スケート"]
[null,null,null,null,null,null,17,null,"ダンス"]
[null,null,null,null,null,null,18,null,"柔道"]
[null,null,null,null,null,null,19,null,"剣道"]
[null,null,null,null,null,null,20,null,"軟 式 野 球"]
[null,null,null,null,null,null,21,null,"レスリング"]
[null,null,null,null,null,null,22,null,"弓道"]
[null,null,null,null,null,null,23,null,"自転車競技"]
[null,null,null,null,null,null,24,null,"ボクシング"]
[null,null,null,null,null,null,25,null,"ウエイトリフティング"]
[null,null,null,null,null,null,26,null,"フェンシング"]
[null,null,null,null,null,null,27,null,"テニス"]
[null,null,null,null,null,null,28,null,"空手道"]
[null,null,null,null,null,null,29,null,"アーチェリー"]
[null,null,null,null,null,null,30,null,"ローイング"]
[null,null,null,null,null,null,31,null,"ホッケー"]
[null,null,null,null,null,null,null,null,"なぎなた"]
[null,null,null,null,null,null,null,null,"カヌー"]
[null,null,null,null,null,null,null,null,"少林寺拳法"]